Target
Type-1 angiotensin II receptor B
Ligand
BDBM50010146
Substrate
Meas. Tech.
ChEMBL_36481 (CHEMBL651550)
IC50
200±n/a nM
Citation
 Bühlmayer, PCriscione, LFuhrer, WFuret, Pde Gasparo, MStutz, SWhitebread, S Nonpeptidic angiotensin II antagonists: synthesis and in vitro activity of a series of novel naphthalene and tetrahydronaphthalene derivatives. J Med Chem 34:3105-14 (1991)  
Target
Name:
Type-1 angiotensin II receptor B
Synonyms:
AGTRB_RAT Agtr1 Angiotensin II AT1B Angiotensin II type 1b (AT-1b) receptor Type-1B angiotensin II receptor
Type:
Enzyme Catalytic Domain
Mol. Mass.:
40929.44
Organism:
RAT
Description:
Angiotensin II AT1B 0 RAT::P29089
Residue:
359
  
Inhibitor
Name:
BDBM50010146
Synonyms:
CHEMBL322683 | {2-Butyl-5-chloro-1-[6-(1H-tetrazol-5-yl)-naphthalen-2-ylmethyl]-1H-imidazol-4-yl}-methanol
Type:
Small organic molecule
Emp. Form.:
C20H21ClN6O
Mol. Mass.:
396.873
SMILES:
CCCCc1nc(CO)c(Cl)n1Cc1ccc2cc(ccc2c1)-c1nnn[nH]1
: