Target
Type-1 angiotensin II receptor B
Ligand
BDBM50010152
Substrate
Meas. Tech.
ChEBML_36482
IC50
8900±n/a nM
Citation
 Bühlmayer, PCriscione, LFuhrer, WFuret, Pde Gasparo, MStutz, SWhitebread, S Nonpeptidic angiotensin II antagonists: synthesis and in vitro activity of a series of novel naphthalene and tetrahydronaphthalene derivatives. J Med Chem 34:3105-14 (1991)  
Target
Name:
Type-1 angiotensin II receptor B
Synonyms:
AGTRB_RAT Agtr1 Angiotensin II AT1B Angiotensin II type 1b (AT-1b) receptor Type-1B angiotensin II receptor
Type:
Enzyme Catalytic Domain
Mol. Mass.:
40929.44
Organism:
RAT
Description:
Angiotensin II AT1B 0 RAT::P29089
Residue:
359
  
Inhibitor
Name:
BDBM50010152
Synonyms:
6-(2-Butyl-4-chloro-5-hydroxymethyl-imidazol-1-ylmethyl)-1,2,3,4-tetrahydro-naphthalene-2-carboxylic acid | CHEMBL106682
Type:
Small organic molecule
Emp. Form.:
C20H25ClN2O3
Mol. Mass.:
376.877
SMILES:
CCCCc1nc(Cl)c(CO)n1Cc1ccc2CC(CCc2c1)C(O)=O
: