Target
Renin
Ligand
BDBM50010898
Substrate
Meas. Tech.
ChEBML_195750
IC50
1.7±n/a nM
Citation
 Bradbury, RHRivett, JE 1,2,4-Triazolo[4,3-a]pyrazine derivatives with human renin inhibitory activity. 3.1 Synthesis and biological properties of aminodeoxystatine and difluorostatone derivatives. J Med Chem 34:151-7 (1991)  
Target
Name:
Renin
Synonyms:
Angiotensinogenase RENI_HUMAN
Type:
Enzyme
Mol. Mass.:
45058.99
Organism:
Homo sapiens (Human)
Description:
Residue:
406
  
Inhibitor
Name:
BDBM50010898
Synonyms:
7-Cyclohexyl-3-hydroxy-4-[2-(8-isobutyl-6-phenyl-[1,2,4]triazolo[4,3-a]pyrazin-3-yl)-3-pyridin-3-yl-propionylamino]-6-methyl-heptanoic acid [1-(3-aminomethyl-benzylcarbamoyl)-3-methyl-butyl]-amide | CHEMBL41567
Type:
Small organic molecule
Emp. Form.:
C51H69N9O4
Mol. Mass.:
872.1515
SMILES:
CC(C)CC(NC(=O)CC(O)C(CC(C)CC1CCCCC1)NC(=O)C(Cc1cccnc1)c1nnc2c(CC(C)C)nc(cn12)-c1ccccc1)C(=O)NCc1cccc(CN)c1
: