Target
Histone deacetylase 7
Ligand
BDBM50252395
Substrate
Meas. Tech.
ChEBML_1697943
Ki
442±n/a nM
Citation
 Sellmer, AStangl, HBeyer, MGrünstein, ELeonhardt, MPongratz, HEichhorn, EElz, SStriegl, BJenei-Lanzl, ZDove, SStraub, RHKrämer, OHMahboobi, S Marbostat-100 Defines a New Class of Potent and Selective Antiinflammatory and Antirheumatic Histone Deacetylase 6 Inhibitors. J Med Chem 61:3454-3477 (2018)  
Target
Name:
Histone deacetylase 7
Synonyms:
HD7 HDAC7A Histone acetylase 7 (HDAC7) Human HDAC7
Type:
Chromatin regulator; hydrolase; repressor
Mol. Mass.:
102942.62
Organism:
Homo sapiens (Human)
Description:
Q8WUI4
Residue:
952
  
Inhibitor
Name:
BDBM50252395
Synonyms:
CHEMBL4087616
Type:
Small organic molecule
Emp. Form.:
C22H20N4O4
Mol. Mass.:
404.4186
SMILES:
CN1C(=O)C2CN(Cc3c2c2ccccc2n3Cc2ccc(cc2)C(=O)NO)C1=O
: