Target
Gastrin/cholecystokinin type B receptor
Ligand
BDBM50011199
Substrate
Meas. Tech.
ChEBML_47828
IC50
3840±n/a nM
Citation
 Holladay, MWLin, CWMay, CSGarvey, DSWitte, DGMiller, TRWolfram, CANadzan, AM trans-3-n-propyl-L-proline is a highly favorable, conformationally restricted replacement for methionine in the C-terminal tetrapeptide of cholecystokinin. Stereoselective synthesis of 3-allyl- and 3-n-propyl-L-proline derivatives from 4-hydroxy-L-proline. J Med Chem 34:455-7 (1991)  
Target
Name:
Gastrin/cholecystokinin type B receptor
Synonyms:
CCK-2 receptor CCK-BR CCKRB Cholecystokinin receptor GASR_HUMAN | Gastrin/cholecystokinin type B receptor
Type:
G Protein-Coupled Receptor (GPCR)
Mol. Mass.:
48445.79
Organism:
Homo sapiens (Human)
Description:
Stable expression of human CCK-2 receptors in HEK 293 cells.
Residue:
447
  
Inhibitor
Name:
BDBM50011199
Synonyms:
3-{2-[2-tert-Butoxycarbonylamino-3-(1H-indol-3-yl)-propionylamino]-propionylamino}-N-(1-carbamoyl-2-phenyl-ethyl)-succinamic acid | CHEMBL333299
Type:
Small organic molecule
Emp. Form.:
C32H40N6O8
Mol. Mass.:
636.6954
SMILES:
C[C@H](NC(=O)[C@H](Cc1c[nH]c2ccccc12)NC(=O)OC(C)(C)C)C(=O)N[C@@H](CC(O)=O)C(=O)N[C@@H](Cc1ccccc1)C(N)=O
: