Target
Beta-1 adrenergic receptor
Ligand
BDBM25392
Substrate
Meas. Tech.
ChEMBL_1700066 (CHEMBL4051048)
EC50
3.2±n/a nM
Citation
 Wada, YNakano, SMorimoto, AKasahara, KIHayashi, TTakada, YSuzuki, HNiwa-Sakai, MOhashi, SMori, MHirokawa, TShuto, S Discovery of Novel Indazole Derivatives as Orally Available? J Med Chem 60:3252-3265 (2017)  
Target
Name:
Beta-1 adrenergic receptor
Synonyms:
ADRB1 ADRB1_HUMAN Beta-1 adrenoceptor adrenergic Beta1
Type:
G Protein-Coupled Receptor (GPCR)
Mol. Mass.:
51338.40
Organism:
Homo sapiens (Human)
Description:
P08588
Residue:
477
  
Inhibitor
Name:
BDBM25392
Synonyms:
4-[1-hydroxy-2-(isopropylamino)ethyl]pyrocatechol;hydrochloride 4-{1-hydroxy-2-[(propan-2-yl)amino]ethyl}benzene-1,2-diol, 2 ISOPROTERONOL Isoproterenol Isoproterenol,(+) Norisodrine | Novodrin
Type:
Small organic molecule
Emp. Form.:
C11H17NO3
Mol. Mass.:
211.2576
SMILES:
CC(C)NCC(O)c1ccc(O)c(O)c1
: