Target
Neurotensin receptor type 1
Ligand
BDBM50342242
Substrate
Meas. Tech.
ChEMBL_1700223 (CHEMBL4051205)
IC50
0.330000±n/a nM
Citation
 Fanelli, RFloquet, NBesserer-Offroy, ÉDelort, BVivancos, MLongpré, JMRenault, PMartinez, JSarret, PCavelier, F Use of Molecular Modeling to Design Selective NTS2 Neurotensin Analogues. J Med Chem 60:3303-3313 (2017)  
Target
Name:
Neurotensin receptor type 1
Synonyms:
Dopamine receptor D2L/neurotensin receptor NTS1 NTRR Neurotensin receptor 1 | neurotensin receptor type 1
Type:
PROTEIN
Mol. Mass.:
46278.89
Organism:
Homo sapiens (Human)
Description:
ChEMBL_1453811
Residue:
418
  
Inhibitor
Name:
BDBM50342242
Synonyms:
(S)-2-((2S,3S)-2-((S)-2-((S)-1-((S)-6-amino-2-((S)-2,6-diaminohexanamido)hexanoyl)pyrrolidine-2-carboxamido)-3-(4-hydroxyphenyl)propanamido)-3-methylpentanamido)-4-methylpentanoic acid H-Lys-Lys-Pro-Tyr-Ile-Leu-OH
Type:
Small organic molecule
Emp. Form.:
C38H64N8O8
Mol. Mass.:
760.9636
SMILES:
CC[C@H](C)[C@H](NC(=O)[C@H](Cc1ccc(O)cc1)NC(=O)[C@@H]1CCCN1C(=O)[C@H](CCCCN)NC(=O)[C@@H](N)CCCCN)C(=O)N[C@@H](CC(C)C)C(O)=O
: