Target
Muscarinic acetylcholine receptor M2
Ligand
BDBM50149891
Substrate
Meas. Tech.
ChEMBL_1700402 (CHEMBL4051384)
IC50
776±n/a nM
Citation
 Pegoli, AShe, XWifling, DHübner, HBernhardt, GGmeiner, PKeller, M Radiolabeled Dibenzodiazepinone-Type Antagonists Give Evidence of Dualsteric Binding at the M J Med Chem 60:3314-3334 (2017)  
Target
Name:
Muscarinic acetylcholine receptor M2
Synonyms:
ACM2_HUMAN Cholinergic, muscarinic M2 Muscarinic acetylcholine receptor M2 and M5 | RecName: Full=Muscarinic acetylcholine receptor M2
Type:
GPCR
Mol. Mass.:
51730.61
Organism:
Homo sapiens (Human)
Description:
P08172
Residue:
466
  
Inhibitor
Name:
BDBM50149891
Synonyms:
2,2',2''-[1,2,3-BENZENE-TRIYLTRIS(OXY)]TRIS[N,N,N-TRIETHYLETHANAMINIUM] GALLAMINE
Type:
Small organic molecule
Emp. Form.:
C30H60N3O3
Mol. Mass.:
510.8141
SMILES:
CC[N+](CC)(CC)CCOc1cccc(OCC[N+](CC)(CC)CC)c1OCC[N+](CC)(CC)CC
: