Target
Tyrosine-protein kinase Lck
Ligand
BDBM50011429
Substrate
Meas. Tech.
ChEBML_210731
IC50
7400±n/a nM
Citation
 Cushman, MNagarathnam, DBurg, DLGeahlen, RL Synthesis and protein-tyrosine kinase inhibitory activities of flavonoid analogues. J Med Chem 34:798-806 (1991)  
Target
Name:
Tyrosine-protein kinase Lck
Synonyms:
2.7.10.2 LCK_HUMAN Leukocyte C-terminal Src kinase Lymphocyte-specific protein tyrosine kinase Protein YT16 Proto-oncogene tyrosine-protein kinase LCK T cell-specific protein-tyrosine kinase
Type:
Mol. Mass.:
57987.83
Organism:
Homo sapiens (Human)
Description:
P06239
Residue:
509
  
Inhibitor
Name:
BDBM50011429
Synonyms:
2-(4-Amino-phenyl)-5,7-dihydroxy-chromen-4-one CHEMBL167154
Type:
Small organic molecule
Emp. Form.:
C15H11NO4
Mol. Mass.:
269.2521
SMILES:
Nc1ccc(cc1)-c1cc(=O)c2c(O)cc(O)cc2o1
: