Target
Adenosine receptor A3
Ligand
BDBM50078425
Substrate
Meas. Tech.
ChEMBL_1701162 (CHEMBL4052144)
Ki
600±n/a nM
Citation
 Petrelli, RScortichini, MKachler, SBoccella, SCerchia, CTorquati, IDel Bello, FSalvemini, DNovellino, ELuongo, LMaione, SJacobson, KALavecchia, AKlotz, KNCappellacci, L Exploring the Role of N J Med Chem 60:4327-4341 (2017)  
Target
Name:
Adenosine receptor A3
Synonyms:
AA3R_RAT Adenosine receptor A2a and A3 | Adora3
Type:
PROTEIN
Mol. Mass.:
36643.73
Organism:
Rattus norvegicus
Description:
ChEMBL_479910
Residue:
320
  
Inhibitor
Name:
BDBM50078425
Synonyms:
CHEMBL3414939
Type:
Small organic molecule
Emp. Form.:
C13H16ClN9O3
Mol. Mass.:
381.778
SMILES:
CCn1nnc(n1)[C@H]1O[C@H]([C@H](O)[C@@H]1O)n1cnc2c(NC)nc(Cl)nc12
: