Target
Bcl-2-like protein 1
Ligand
BDBM31406
Substrate
Meas. Tech.
ChEMBL_1701631 (CHEMBL4052864)
Ki
114±n/a nM
Citation
 Yap, JLChen, LLanning, MEFletcher, S Expanding the Cancer Arsenal with Targeted Therapies: Disarmament of the Antiapoptotic Bcl-2 Proteins by Small Molecules. J Med Chem 60:821-838 (2017)  
Target
Name:
Bcl-2-like protein 1
Synonyms:
Anti-apoptotic Bcl-2 protein Apoptosis regulator Bcl-X BCL2-like 1 isoform 1 BCL2L1 Bcl-2-like protein 1 (Bcl-XL) Bcl-xL/Bcl-2-binding component 3 Bcl2-antagonist of cell death (BAD)
Type:
Mitochondrion membrane; Single-pass membrane protein
Mol. Mass.:
26039.60
Organism:
Homo sapiens (Human)
Description:
Residue:
233
  
Inhibitor
Name:
BDBM31406
Synonyms:
terphenyl scaffold, 14
Type:
Small organic molecule
Emp. Form.:
C42H44O5
Mol. Mass.:
628.7958
SMILES:
CC(C)Cc1cc(ccc1OCC(O)=O)-c1ccc(cc1Cc1cccc2ccccc12)-c1ccc(CCC(O)=O)cc1CC(C)C
: