Target
Methionine aminopeptidase 1
Ligand
BDBM17847
Substrate
Meas. Tech.
ChEMBL_1702323 (CHEMBL4053556)
IC50
400±n/a nM
Citation
 White, KNTenney, KCrews, P The Bengamides: A Mini-Review of Natural Sources, Analogues, Biological Properties, Biosynthetic Origins, and Future Prospects. J Nat Prod 80:740-755 (2017)  
Target
Name:
Methionine aminopeptidase 1
Synonyms:
Aminopeptidase MAP 1 METAP1 Methionine Aminopeptidase Type 1 (MetAP1) | Peptidase M 1
Type:
Enzyme
Mol. Mass.:
43220.79
Organism:
Homo sapiens (Human)
Description:
MetAP1 with an N-terminal six histidine tag was expressed in baculovirus infected sf9 cells.
Residue:
386
  
Inhibitor
Name:
BDBM17847
Synonyms:
CHEMBL327579 tert-butyl N-[2-(1,3-thiazol-2-ylcarbamoyl)pyridin-3-yl]carbamate
Type:
Small organic molecule
Emp. Form.:
C14H16N4O3S
Mol. Mass.:
320.367
SMILES:
CC(C)(C)OC(=O)Nc1cccnc1C(=O)Nc1nccs1
: