Target
Methionine aminopeptidase 1
Ligand
BDBM50267199
Substrate
Meas. Tech.
ChEMBL_1702323 (CHEMBL4053556)
IC50
100±n/a nM
Citation
 White, KNTenney, KCrews, P The Bengamides: A Mini-Review of Natural Sources, Analogues, Biological Properties, Biosynthetic Origins, and Future Prospects. J Nat Prod 80:740-755 (2017)  
Target
Name:
Methionine aminopeptidase 1
Synonyms:
Aminopeptidase MAP 1 METAP1 Methionine Aminopeptidase Type 1 (MetAP1) | Peptidase M 1
Type:
Enzyme
Mol. Mass.:
43220.79
Organism:
Homo sapiens (Human)
Description:
MetAP1 with an N-terminal six histidine tag was expressed in baculovirus infected sf9 cells.
Residue:
386
  
Inhibitor
Name:
BDBM50267199
Synonyms:
CHEMBL4079583
Type:
Small organic molecule
Emp. Form.:
C24H23N5O
Mol. Mass.:
397.4723
SMILES:
COc1ccc(cc1)N1CCN(CC1)c1nc(nc2ccccc12)-c1ccccn1
: