Target
Polyunsaturated fatty acid lipoxygenase ALOX15B
Ligand
BDBM50011932
Substrate
Meas. Tech.
ChEBML_28
IC50
330±n/a nM
Citation
 Cho, HUeda, MTamaoka, MHamaguchi, MAisaka, KKiso, YInoue, TOgino, RTatsuoka, TIshihara, T Novel caffeic acid derivatives: extremely potent inhibitors of 12-lipoxygenase. J Med Chem 34:1503-5 (1991)  
Target
Name:
Polyunsaturated fatty acid lipoxygenase ALOX15B
Synonyms:
Alox15b LX15B_RAT
Type:
PROTEIN
Mol. Mass.:
76140.88
Organism:
Rattus norvegicus
Description:
ChEMBL_12426
Residue:
677
  
Inhibitor
Name:
BDBM50011932
Synonyms:
2-Cyano-3-(3,4-dihydroxy-phenyl)-acrylic acid ethyl ester | CHEMBL38168
Type:
Small organic molecule
Emp. Form.:
C12H11NO4
Mol. Mass.:
233.22
SMILES:
CCOC(=O)C(=C\c1ccc(O)c(O)c1)\C#N
: