Target
Polyunsaturated fatty acid lipoxygenase ALOX15B
Ligand
BDBM50011938
Substrate
Meas. Tech.
ChEBML_28
IC50
500±n/a nM
Citation
 Cho, HUeda, MTamaoka, MHamaguchi, MAisaka, KKiso, YInoue, TOgino, RTatsuoka, TIshihara, T Novel caffeic acid derivatives: extremely potent inhibitors of 12-lipoxygenase. J Med Chem 34:1503-5 (1991)  
Target
Name:
Polyunsaturated fatty acid lipoxygenase ALOX15B
Synonyms:
Alox15b LX15B_RAT
Type:
PROTEIN
Mol. Mass.:
76140.88
Organism:
Rattus norvegicus
Description:
ChEMBL_12426
Residue:
677
  
Inhibitor
Name:
BDBM50011938
Synonyms:
2-Cyano-3-(3,4-dihydroxy-phenyl)-acrylic acid 2-thiophen-2-yl-ethyl ester | CHEMBL37081
Type:
Small organic molecule
Emp. Form.:
C16H13NO4S
Mol. Mass.:
315.344
SMILES:
Oc1ccc(\C=C(/C#N)C(=O)OCCc2cccs2)cc1O
: