Target
Polyunsaturated fatty acid lipoxygenase ALOX15B
Ligand
BDBM50009001
Substrate
Meas. Tech.
ChEBML_28
IC50
260±n/a nM
Citation
 Cho, HUeda, MTamaoka, MHamaguchi, MAisaka, KKiso, YInoue, TOgino, RTatsuoka, TIshihara, T Novel caffeic acid derivatives: extremely potent inhibitors of 12-lipoxygenase. J Med Chem 34:1503-5 (1991)  
Target
Name:
Polyunsaturated fatty acid lipoxygenase ALOX15B
Synonyms:
Alox15b LX15B_RAT
Type:
PROTEIN
Mol. Mass.:
76140.88
Organism:
Rattus norvegicus
Description:
ChEMBL_12426
Residue:
677
  
Inhibitor
Name:
BDBM50009001
Synonyms:
5,6,7-Trihydroxyflavone Baicalein Baicalein, 8 US10252984, Table 2.33
Type:
Small organic molecule
Emp. Form.:
C15H10O5
Mol. Mass.:
270.2369
SMILES:
Oc1cc2oc(cc(=O)c2c(O)c1O)-c1ccccc1
: