Target
Mitogen-activated protein kinase kinase kinase 20
Ligand
BDBM50268019
Substrate
Meas. Tech.
ChEMBL_1704329 (CHEMBL4055562)
IC50
19±n/a nM
Citation
 Chang, YLu, XShibu, MADai, YBLuo, JZhang, YLi, YZhao, PZhang, ZXu, YTu, ZCZhang, QWYun, CHHuang, CYDing, K Structure Based Design of N-(3-((1H-Pyrazolo[3,4-b]pyridin-5-yl)ethynyl)benzenesulfonamides as Selective Leucine-Zipper and Sterile-? Motif Kinase (ZAK) Inhibitors. J Med Chem 60:5927-5932 (2017)  
Target
Name:
Mitogen-activated protein kinase kinase kinase 20
Synonyms:
M3K20_HUMAN MLK7 Mixed lineage kinase 7 | ZAK
Type:
PROTEIN
Mol. Mass.:
91168.58
Organism:
Homo sapiens (Human)
Description:
ChEMBL_1495629
Residue:
800
  
Inhibitor
Name:
BDBM50268019
Synonyms:
CHEMBL4080626
Type:
Small organic molecule
Emp. Form.:
C21H14F2N4O3S
Mol. Mass.:
440.423
SMILES:
COc1n[nH]c2ncc(cc12)C#Cc1c(F)ccc(NS(=O)(=O)c2ccccc2)c1F
: