Target
Neprilysin
Ligand
BDBM50050126
Substrate
Meas. Tech.
ChEMBL_1705589 (CHEMBL4056822)
Ki
23±n/a nM
Citation
 Poras, HPatouret, RLeiris, SOuimet, TFournié-Zaluski, MCRoques, BP Substituted?-mercaptoketones, new types of specific neprilysin inhibitors. Bioorg Med Chem Lett 27:3883-3890 (2017)  
Target
Name:
Neprilysin
Synonyms:
Atriopeptidase CD_antigen=CD10 EPN MME NEP_HUMAN Neutral endopeptidase | Neutral endopeptidase 24.11
Type:
Enzyme
Mol. Mass.:
85505.38
Organism:
Homo sapiens (Human)
Description:
P08473
Residue:
750
  
Inhibitor
Name:
BDBM50050126
Synonyms:
(S)-2-((S)-2-Mercapto-3-phenyl-propionylamino)-3-phenyl-propionic acid | CHEMBL19621
Type:
Small organic molecule
Emp. Form.:
C18H19NO3S
Mol. Mass.:
329.413
SMILES:
OC(=O)[C@H](Cc1ccccc1)NC(=O)[C@@H](S)Cc1ccccc1
: