Target
Pepsin A
Ligand
BDBM50012620
Substrate
Meas. Tech.
ChEMBL_154019 (CHEMBL857517)
Ki
1.13±n/a nM
Citation
 McConnell, RMFrizzell, DCamp, AEvans, AJones, WCagle, C New pepstatin analogues: synthesis and pepsin inhibition. J Med Chem 34:2298-300 (1991)  
Target
Name:
Pepsin A
Synonyms:
PEPA_PIG Pepsin | Pepsin A precursor
Type:
Enzyme
Mol. Mass.:
41232.87
Organism:
Porcine
Description:
Residue:
385
  
Inhibitor
Name:
BDBM50012620
Synonyms:
3-hydroxy-4-(4-hydroxyphenyl)-4-[2-methyl-1-[2-methyl-1-benzyloxycarboxamido-(1S)-propylcarboxamido]-(1S)-propylcarboxamido]butanoic acid | CHEMBL306067
Type:
Small organic molecule
Emp. Form.:
C28H37N3O8
Mol. Mass.:
543.6087
SMILES:
CC(C)[C@H](NC(=O)OCc1ccccc1)C(=O)N[C@@H](C(C)C)C(=O)NC(C(O)CC(O)=O)c1ccc(O)cc1
: