Target
Pepsin A
Ligand
BDBM50012623
Substrate
Meas. Tech.
ChEMBL_154019 (CHEMBL857517)
Ki
0.000±n/a nM
Citation
 McConnell, RMFrizzell, DCamp, AEvans, AJones, WCagle, C New pepstatin analogues: synthesis and pepsin inhibition. J Med Chem 34:2298-300 (1991)  
Target
Name:
Pepsin A
Synonyms:
PEPA_PIG Pepsin | Pepsin A precursor
Type:
Enzyme
Mol. Mass.:
41232.87
Organism:
Porcine
Description:
Residue:
385
  
Inhibitor
Name:
BDBM50012623
Synonyms:
3-hydroxy-6-methyl-4-[2-methyl-1-[2-methyl-1-benzyloxycarboxamido-(1S)-propylcarboxamido]-(1S)-propylcarboxamido]heptanoic acid | CHEMBL74075
Type:
Small organic molecule
Emp. Form.:
C26H41N3O7
Mol. Mass.:
507.6196
SMILES:
CC(C)CC(NC(=O)[C@@H](NC(=O)[C@@H](NC(=O)OCc1ccccc1)C(C)C)C(C)C)C(O)CC(O)=O
: