Target
Aryl hydrocarbon receptor
Ligand
BDBM50269354
Substrate
Meas. Tech.
ChEMBL_1706516 (CHEMBL4057749)
IC50
7600±n/a nM
Citation
 Williams, ISJoshi, PGatchie, LSharma, MSatti, NKVishwakarma, RAChaudhuri, BBharate, SB Synthesis and biological evaluation of pyrrole-based chalcones as CYP1 enzyme inhibitors, for possible prevention of cancer and overcoming cisplatin resistance. Bioorg Med Chem Lett 27:3683-3687 (2017)  
Target
Name:
Aryl hydrocarbon receptor
Synonyms:
AHR BHLHE76 aryl hydrocarbon receptor precursor
Type:
PROTEIN
Mol. Mass.:
96143.77
Organism:
Homo sapiens (Human)
Description:
ChEMBL_1503828
Residue:
848
  
Inhibitor
Name:
BDBM50269354
Synonyms:
CHEMBL1335197
Type:
Small organic molecule
Emp. Form.:
C13H10ClNO
Mol. Mass.:
231.678
SMILES:
Clc1ccccc1\C=C\C(=O)c1ccc[nH]1
: