Target
Heat shock protein HSP 90-alpha
Ligand
BDBM50087812
Substrate
Meas. Tech.
ChEMBL_1708207 (CHEMBL4059440)
IC50
13200±n/a nM
Citation
 Que, NLSCrowley, VMDuerfeldt, ASZhao, JKent, CNBlagg, BSJGewirth, DT Structure Based Design of a Grp94-Selective Inhibitor: Exploiting a Key Residue in Grp94 To Optimize Paralog-Selective Binding. J Med Chem 61:2793-2805 (2018)  
Target
Name:
Heat shock protein HSP 90-alpha
Synonyms:
HS90A_HUMAN HSP86 HSP90AA1 HSPCA Heat shock 86 kDa Heat shock protein HSP 90-alpha (HSP90) LAP-2 Lipopolysaccharide-associated protein 2 heat shock protein 90kDa alpha (cytosolic), class A member 1 isoform 2
Type:
Molecular Chaperone
Mol. Mass.:
84623.45
Organism:
Homo sapiens (Human)
Description:
P07900
Residue:
732
  
Inhibitor
Name:
BDBM50087812
Synonyms:
CHEMBL3426787
Type:
Small organic molecule
Emp. Form.:
C20H19ClN2O4
Mol. Mass.:
386.829
SMILES:
COC(=O)c1c(O)cc(O)c(Cl)c1CCc1nccn1Cc1ccccc1
: