Target
Cysteinyl leukotriene receptor 1
Ligand
BDBM50013530
Substrate
Meas. Tech.
ChEBML_52212
Ki
240±n/a nM
Citation
 Youssefyeh, RDMagnien, ELee, TDChan, WKLin, CJGalemmo, RAJohnson, WHTan, JCampbell, HFHuang, FC Development of a novel series of (2-quinolinylmethoxy)phenyl-containing compounds as high-affinity leukotriene receptor antagonists. 1. Initial structure-activity relationships. J Med Chem 33:1186-94 (1990)  
Target
Name:
Cysteinyl leukotriene receptor 1
Synonyms:
CLTR1_CAVPO | CYSLTR1
Type:
Enzyme Catalytic Domain
Mol. Mass.:
39007.58
Organism:
GUINEA PIG
Description:
Leukotriene D4 0 GUINEA PIG::Q2NNR5
Residue:
340
  
Inhibitor
Name:
BDBM50013530
Synonyms:
2-{4-Ethyl-3-[3-(1H-tetrazol-5-yl)-propoxy]-phenoxymethyl}-quinoline | CHEMBL18309
Type:
Small organic molecule
Emp. Form.:
C22H23N5O2
Mol. Mass.:
389.4503
SMILES:
CCc1ccc(OCc2ccc3ccccc3n2)cc1OCCCc1nnn[nH]1
: