Target
Nuclear receptor ROR-beta
Ligand
BDBM50271674
Substrate
Meas. Tech.
ChEMBL_1711299 (CHEMBL4121348)
Kd
3.3±n/a nM
Citation
 Gege, CCummings, MDAlbers, MKinzel, OKleymann, GSchlüter, TSteeneck, CNelen, MIMilligan, CSpurlino, JXue, XLeonard, KEdwards, JPFourie, AGoldberg, SDHoffmann, T Identification and biological evaluation of thiazole-based inverse agonists of ROR?t. Bioorg Med Chem Lett 28:1446-1455 (2018)  
Target
Name:
Nuclear receptor ROR-beta
Synonyms:
NR1F2 Nuclear receptor subfamily 1 group F member 2 RORB_HUMAN Retinoid-related orphan receptor-beta
Type:
PROTEIN
Mol. Mass.:
53227.30
Organism:
Homo sapiens (Human)
Description:
ChEMBL_107979
Residue:
470
  
Inhibitor
Name:
BDBM50271674
Synonyms:
CHEMBL4129790
Type:
Small organic molecule
Emp. Form.:
C31H38F3N3O4S
Mol. Mass.:
605.711
SMILES:
CC[C@H](NC(=O)c1cc(cc(c1)C1(C)CC1)-c1sc(nc1CC1CCCCC1)C(=O)N[C@H]1C[C@@H](C1)C(O)=O)C(F)(F)F
: