Target
Small conductance calcium-activated potassium channel protein 1/2/3
Ligand
BDBM392076
Substrate
Meas. Tech.
ChEBML_1711462
IC50
0.012000±n/a nM
Citation
 Gege, CCummings, MDAlbers, MKinzel, OKleymann, GSchlüter, TSteeneck, CNelen, MIMilligan, CSpurlino, JXue, XLeonard, KEdwards, JPFourie, AGoldberg, SDHoffmann, T Identification and biological evaluation of thiazole-based inverse agonists of ROR?t. Bioorg Med Chem Lett 28:1446-1455 (2018)  
Target
Name:
Small conductance calcium-activated potassium channel protein 1/2/3
Synonyms:
Small conductance calcium-activated potassium channel
Type:
Mol. Mass.:
Description:
ASSAY_ID of ChEMBL is 1559987
Components:
This complex has 3 components.
Component 1
Name:
Small conductance calcium-activated potassium channel protein 3
Synonyms:
KCNN3_RAT SK3 | Small conductance calcium-activated potassium channel
Type:
PROTEIN
Mol. Mass.:
81476.29
Organism:
Rattus norvegicus
Description:
ChEMBL_494975
Residue:
732
  
Component 2
Name:
Small conductance calcium-activated potassium channel protein 1
Synonyms:
KCNN1_RAT Potassium Channel, Ca2+ Act., VS Small conductance calcium-activated potassium channel
Type:
Enzyme Catalytic Domain
Mol. Mass.:
59231.59
Organism:
RAT
Description:
Potassium Channel, Ca2+ Act., VS 0 RAT::P70606
Residue:
536
  
Component 3
Name:
Small conductance calcium-activated potassium channel protein 2
Synonyms:
KCNN2_RAT Small conductance calcium-activated potassium channel Small conductance calcium-activated potassium channel protein 2 (KCa2.2)
Type:
Protein
Mol. Mass.:
63876.72
Organism:
Rattus norvegicus (Rat)
Description:
P70604
Residue:
580
  
Inhibitor
Name:
BDBM392076
Synonyms:
US10301272, Example 7/9
Type:
Small organic molecule
Emp. Form.:
C30H37N3O5S2
Mol. Mass.:
583.762
SMILES:
CC(C)(C)NS(=O)(=O)c1ccc(-c2sc(nc2CC2CCCCC2)C(=O)N[C@H]2C[C@@H](C2)C(O)=O)c2ccccc12
: