Target
Bromodomain-containing protein 4
Ligand
BDBM50399434
Substrate
Meas. Tech.
ChEMBL_1712939 (CHEMBL4122988)
IC50
220±n/a nM
Citation
 Borysko, PMoroz, YSVasylchenko, OVHurmach, VVStarodubtseva, AStefanishena, NNesteruk, KZozulya, SKondratov, ISGrygorenko, OO Straightforward hit identification approach in fragment-based discovery of bromodomain-containing protein 4 (BRD4) inhibitors. Bioorg Med Chem 26:3399-3405 (2018)  
Target
Name:
Bromodomain-containing protein 4
Synonyms:
BRD4 Bromodomain-containing protein 4 (BRD4) Protein HUNK1
Type:
Protein
Mol. Mass.:
152264.84
Organism:
Homo sapiens (Human)
Description:
O60885
Residue:
1362
  
Inhibitor
Name:
BDBM50399434
Synonyms:
CHEMBL2179387
Type:
Small organic molecule
Emp. Form.:
C16H17N3O4S
Mol. Mass.:
347.389
SMILES:
COc1ccccc1S(=O)(=O)Nc1ccc2NC(=O)N(C)Cc2c1
: