Target
Mu-type opioid receptor
Ligand
BDBM50013938
Substrate
Meas. Tech.
ChEBML_148837
Ki
0.330±n/a nM
Citation
 Lalinde, NMoliterni, JWright, DSpencer, HKOssipov, MHSpaulding, TCRudo, FG Synthesis and pharmacological evaluation of a series of new 3-methyl-1,4-disubstituted-piperidine analgesics. J Med Chem 33:2876-82 (1990)  
Target
Name:
Mu-type opioid receptor
Synonyms:
MOR-1 Mu-type opioid receptor (MOR) OPRM_RAT Opioid receptor B Ror-b
Type:
G Protein-Coupled Receptor (GPCR)
Mol. Mass.:
44503.11
Organism:
Rattus norvegicus (rat)
Description:
Competition binding assays were carried out using membrane preparations from transfected HN9.10 cells that constitutively expressed the mu opioid receptor.
Residue:
398
  
Inhibitor
Name:
BDBM50013938
Synonyms:
2-Methoxy-N-(3-methyl-1-phenethyl-piperidin-4-yl)-N-phenyl-acetamide | CHEMBL318958
Type:
Small organic molecule
Emp. Form.:
C23H30N2O2
Mol. Mass.:
366.4965
SMILES:
COCC(=O)N(C1CCN(CCc2ccccc2)CC1C)c1ccccc1
: