Target
Mu-type opioid receptor
Ligand
BDBM50013949
Substrate
Meas. Tech.
ChEBML_148837
Ki
0.780000±n/a nM
Citation
 Lalinde, NMoliterni, JWright, DSpencer, HKOssipov, MHSpaulding, TCRudo, FG Synthesis and pharmacological evaluation of a series of new 3-methyl-1,4-disubstituted-piperidine analgesics. J Med Chem 33:2876-82 (1990)  
Target
Name:
Mu-type opioid receptor
Synonyms:
MOR-1 Mu-type opioid receptor (MOR) OPRM_RAT Opioid receptor B Ror-b
Type:
G Protein-Coupled Receptor (GPCR)
Mol. Mass.:
44503.11
Organism:
Rattus norvegicus (rat)
Description:
Competition binding assays were carried out using membrane preparations from transfected HN9.10 cells that constitutively expressed the mu opioid receptor.
Residue:
398
  
Inhibitor
Name:
BDBM50013949
Synonyms:
CHEMBL95248 | Furan-2-carboxylic acid (2-methoxy-phenyl)-(3-methyl-1-phenethyl-piperidin-4-yl)-amide
Type:
Small organic molecule
Emp. Form.:
C26H30N2O3
Mol. Mass.:
418.528
SMILES:
COc1ccccc1N(C1CCN(CCc2ccccc2)CC1C)C(=O)c1ccco1
: