Target
Histone deacetylase 11
Ligand
BDBM50273520
Substrate
Meas. Tech.
ChEMBL_1713030 (CHEMBL4123079)
IC50
3.0±n/a nM
Citation
 Martin, MWLee, JYLancia, DRNg, PYHan, BThomason, JRLynes, MSMarshall, CGConti, CCollis, AMorales, MADoshi, KRudnitskaya, AYao, LZheng, X Discovery of novel N-hydroxy-2-arylisoindoline-4-carboxamides as potent and selective inhibitors of HDAC11. Bioorg Med Chem Lett 28:2143-2147 (2018)  
Target
Name:
Histone deacetylase 11
Synonyms:
HD11 HDAC11 | Human HDAC11
Type:
Chromatin regulator; hydrolase; repressor
Mol. Mass.:
39187.66
Organism:
Homo sapiens (Human)
Description:
Q96DB2
Residue:
347
  
Inhibitor
Name:
BDBM50273520
Synonyms:
CHEMBL4127735 | US11535607, Example 22-3
Type:
Small organic molecule
Emp. Form.:
C17H16F3N3O2
Mol. Mass.:
351.323
SMILES:
CC1(C)N(Cc2c1cccc2C(=O)NO)c1ccc(nc1)C(F)(F)F
: