Target
Alpha-1B adrenergic receptor
Ligand
BDBM50274053
Substrate
Meas. Tech.
ChEMBL_1713734 (CHEMBL4123783)
Ki
0.128825±n/a nM
Citation
 Sagratini, GBuccioni, MMarucci, GPoggesi, ESkorski, MCostanzi, SGiardinà, D Chiral analogues of (+)-cyclazosin as potent? Bioorg Med Chem 26:3502-3513 (2018)  
Target
Name:
Alpha-1B adrenergic receptor
Synonyms:
ADA1B_HUMAN Adrenergic alpha1B Adrenergic receptor alpha Alpha 1B-adrenoreceptor | Alpha-1B adrenergic receptor
Type:
Enzyme
Mol. Mass.:
56862.13
Organism:
Homo sapiens (Human)
Description:
P35368
Residue:
520
  
Inhibitor
Name:
BDBM50274053
Synonyms:
CHEMBL4126860
Type:
Small organic molecule
Emp. Form.:
C29H39N5O4
Mol. Mass.:
521.6511
SMILES:
[H][C@@]12CCCC[C@]1([H])N(CCN2C(=O)c1ccco1)c1nc(N(CCC)CCC)c2cc(OC)c(OC)cc2n1
: