Target
Phosphatidylinositol 4,5-bisphosphate 3-kinase catalytic subunit gamma isoform
Ligand
BDBM50274649
Substrate
Meas. Tech.
ChEMBL_1714171 (CHEMBL4124220)
IC50
0.794328±n/a nM
Citation
 Pemberton, NMogemark, MArlbrandt, SBold, PCox, RJGardelli, CHolden, NSKarabelas, KKarlsson, JLever, SLi, XLindmark, HNorberg, MPerry, MWDPetersen, JRodrigo Blomqvist, SThomas, MTyrchan, CWestin Eriksson, AZlatoidsky, Pึster, L Discovery of Highly Isoform Selective Orally Bioavailable Phosphoinositide 3-Kinase (PI3K)-? Inhibitors. J Med Chem 61:5435-5441 (2018)  
Target
Name:
Phosphatidylinositol 4,5-bisphosphate 3-kinase catalytic subunit gamma isoform
Synonyms:
PI3-kinase p110 subunit gamma PI3Kgamma PK3CG_HUMAN Phosphatidylinositol 4,5-bisphosphate 3-kinase (PI3K) Phosphatidylinositol 4,5-bisphosphate 3-kinase catalytic subunit gamma (PI3Kgamma) Phosphatidylinositol 4,5-bisphosphate 3-kinase catalytic subunit gamma isoform (PI3K) Phosphatidylinositol-4,5-bisphosphate 3-kinase catalytic subunit gamma isoform Phosphoinositide 3-kinases gamma (PI3K gamma) p120-PI3K
Type:
Enzyme Subunit
Mol. Mass.:
126470.30
Organism:
Homo sapiens (Human)
Description:
P48736
Residue:
1102
  
Inhibitor
Name:
BDBM50274649
Synonyms:
CHEMBL4129600 | US10858355, Example 30
Type:
Small organic molecule
Emp. Form.:
C20H24N4O4S2
Mol. Mass.:
448.559
SMILES:
CNS(=O)(=O)c1cc(cc2CN([C@@H](C)C3CC3)C(=O)c12)-c1sc(NC(C)=O)nc1C
: