Target
Acetylcholinesterase
Ligand
BDBM50327939
Substrate
Meas. Tech.
ChEMBL_1715588 (CHEMBL4125637)
IC50
15000±n/a nM
Citation
 Ibrar, AShehzadi, SASaeed, FKhan, I Developing hybrid molecule therapeutics for diverse enzyme inhibitory action: Active role of coumarin-based structural leads in drug discovery. Bioorg Med Chem 26:3731-3762 (2018)  
Target
Name:
Acetylcholinesterase
Synonyms:
ACES_HUMAN Acetylcholinesterase (AChE) | Acetylcholinesterase (human AChE)
Type:
Enzyme
Mol. Mass.:
67792.70
Organism:
Homo sapiens (Human)
Description:
P22303
Residue:
614
  
Inhibitor
Name:
BDBM50327939
Synonyms:
7-methoxytacrine | CHEMBL1256415
Type:
Small organic molecule
Emp. Form.:
C14H16N2O
Mol. Mass.:
228.2896
SMILES:
COc1ccc2nc3CCCCc3c(N)c2c1
: