Target
Prostaglandin G/H synthase 1
Ligand
BDBM50376383
Substrate
Meas. Tech.
ChEBML_1716251
IC50
7.9±n/a nM
Citation
 Cingolani, GPanella, APerrone, MGVitale, PDi Mauro, GFortuna, CGArmen, RSFerorelli, SSmith, WLScilimati, A Structural basis for selective inhibition of Cyclooxygenase-1 (COX-1) by diarylisoxazoles mofezolac and 3-(5-chlorofuran-2-yl)-5-methyl-4-phenylisoxazole (P6). Eur J Med Chem 138:661-668 (2017)  
Target
Name:
Prostaglandin G/H synthase 1
Synonyms:
COX1 Cyclooxygenase-1 (COX-1) PTGS1 | Prostaglandin G/H synthase (cyclooxygenase)
Type:
Protein
Mol. Mass.:
68868.60
Organism:
Ovis aries (Sheep)
Description:
Residue:
600
  
Inhibitor
Name:
BDBM50376383
Synonyms:
CHEMBL259972
Type:
Small organic molecule
Emp. Form.:
C19H17NO5
Mol. Mass.:
339.342
SMILES:
COc1ccc(cc1)-c1noc(CC(O)=O)c1-c1ccc(OC)cc1
: