Target
Ectonucleoside triphosphate diphosphohydrolase 3
Ligand
BDBM50276784
Substrate
Meas. Tech.
ChEBML_1716386
IC50
>300000±n/a nM
Citation
 Kuhrt, DEjaz, SAAfzal, SKhan, SULecka, JSévigny, JEhlers, PSpannenberg, AIqbal, JLanger, P Chemoselective synthesis and biological evaluation of arylated 2-(Trifluoromethyl) quinolines as nucleotide pyrophosphatase (NPPs) inhibitors. Eur J Med Chem 138:816-829 (2017)  
Target
Name:
Ectonucleoside triphosphate diphosphohydrolase 3
Synonyms:
CD39L3 ENTPD3
Type:
PROTEIN
Mol. Mass.:
59103.51
Organism:
Homo sapiens (Human)
Description:
ChEMBL_612642
Residue:
529
  
Inhibitor
Name:
BDBM50276784
Synonyms:
CHEMBL4159530
Type:
Small organic molecule
Emp. Form.:
C10H3Br2ClF3N
Mol. Mass.:
389.394
SMILES:
FC(F)(F)c1nc2c(Br)cccc2c(Cl)c1Br
: