Target
Polyunsaturated fatty acid 5-lipoxygenase
Ligand
BDBM50015210
Substrate
Meas. Tech.
ChEBML_3971
IC50
7400±n/a nM
Citation
 Hanko, RHammond, MDFruchtmann, RPfitzner, JPlace, GA Design, synthesis, and 5-lipoxygenase-inhibiting properties of 1-thio-substituted butadienes. J Med Chem 33:1163-70 (1990)  
Target
Name:
Polyunsaturated fatty acid 5-lipoxygenase
Synonyms:
Alox5 LOX5_RAT
Type:
PROTEIN
Mol. Mass.:
78082.31
Organism:
Rattus norvegicus
Description:
ChEMBL_1432947
Residue:
673
  
Inhibitor
Name:
BDBM50015210
Synonyms:
3-Pentadeca-1,3,6-trienylsulfanyl-benzoic acid methyl ester | CHEMBL16962
Type:
Small organic molecule
Emp. Form.:
C23H32O2S
Mol. Mass.:
372.564
SMILES:
CCCCCCCC\C=C/C\C=C/C=C/Sc1cccc(c1)C(=O)OC
: