Target
Translocator protein
Ligand
BDBM50279019
Substrate
Meas. Tech.
ChEMBL_1720335 (CHEMBL4135335)
Kd
40±n/a nM
Citation
 Kim, TSon, WSMorshed, MNLondhe, AMJung, SYPark, JHPark, WKLim, SMPark, KDCho, SJJeong, KSLee, JPae, AN Discovery of thienopyrrolotriazine derivatives to protect mitochondrial function against A?-induced neurotoxicity. Eur J Med Chem 141:240-256 (2017)  
Target
Name:
Translocator protein
Synonyms:
BZRP Mitochondrial benzodiazepine receptor PKBS Peripheral-type benzodiazepine receptor TSPO_HUMAN
Type:
Enzyme
Mol. Mass.:
18834.74
Organism:
Homo sapiens (Human)
Description:
P30536
Residue:
169
  
Inhibitor
Name:
BDBM50279019
Synonyms:
CHEMBL1315992
Type:
Small organic molecule
Emp. Form.:
C19H18N4OS2
Mol. Mass.:
382.502
SMILES:
CCc1nnc(SCC(=O)N(C)c2ccccc2)c2cc3sccc3n12
: