Target
Ornithine decarboxylase
Ligand
BDBM50015684
Substrate
Meas. Tech.
ChEBML_147806
Ki
2900000±n/a nM
Citation
 Moyano, NFrydman, JBuldain, GRuiz, OFrydman, RB Inhibition of ornithine decarboxylase by the isomers of 1,4-dimethylputrescine. J Med Chem 33:1969-74 (1990)  
Target
Name:
Ornithine decarboxylase
Synonyms:
DCOR_RAT Odc1
Type:
PROTEIN
Mol. Mass.:
51037.04
Organism:
Rattus norvegicus
Description:
ChEMBL_1344641
Residue:
461
  
Inhibitor
Name:
BDBM50015684
Synonyms:
(racemic+meso) 2-Methyl-pentane-1,4-diamine | CHEMBL59711
Type:
Small organic molecule
Emp. Form.:
C6H16N2
Mol. Mass.:
116.2046
SMILES:
CC(N)CC(C)CN
: