Target
RAS guanyl-releasing protein 1
Ligand
BDBM50280749
Substrate
Meas. Tech.
ChEMBL_1722150 (CHEMBL4137150)
EC50
4880±n/a nM
Citation
 Ann, JCzikora, ASaini, ASZhou, XMitchell, GALewin, NEPeach, MLBlumberg, PMLee, J ?-Arylidene Diacylglycerol-Lactones (DAG-Lactones) as Selective Ras Guanine-Releasing Protein 3 (RasGRP3) Ligands. J Med Chem 61:6261-6276 (2018)  
Target
Name:
RAS guanyl-releasing protein 1
Synonyms:
CalDAG-GEFII GRP1_HUMAN RASGRP1 | Ras guanyl-releasing protein
Type:
PROTEIN
Mol. Mass.:
90418.98
Organism:
Homo sapiens (Human)
Description:
ChEMBL_102739
Residue:
797
  
Inhibitor
Name:
BDBM50280749
Synonyms:
CHEMBL4169454
Type:
Small organic molecule
Emp. Form.:
C21H25NO5
Mol. Mass.:
371.4269
SMILES:
Cn1cc(\C=C2/CC(CO)(COC(=O)C(C)(C)C)OC2=O)c2ccccc12
: