Target
Carbonic anhydrase 7
Ligand
BDBM50279697
Substrate
Meas. Tech.
ChEMBL_1721602 (CHEMBL4136602)
Ki
0.680000±n/a nM
Citation
 Angeli, ATanini, DCapperucci, ASupuran, CT Synthesis of Novel Selenides Bearing Benzenesulfonamide Moieties as Carbonic Anhydrase I, II, IV, VII, and IX Inhibitors. ACS Med Chem Lett 8:1213-1217 (2017)  
Target
Name:
Carbonic anhydrase 7
Synonyms:
CA-VII CAH7_HUMAN Carbonic anhydrase Carbonic anhydrase VII (CA VII)
Type:
Enzyme
Mol. Mass.:
29664.11
Organism:
Homo sapiens (Human)
Description:
Human cloned isozyme.
Residue:
264
  
Inhibitor
Name:
BDBM50279697
Synonyms:
CHEMBL4164295
Type:
Small organic molecule
Emp. Form.:
C16H23NO3SSe
Mol. Mass.:
388.38
SMILES:
[#6]-[#6](=[#6])-[#6@@H]-1-[#6]-[#6]C([#6])([#8])[#6](-[#6]-1)[Se;v2]c1ccc(cc1)S([#7])(=O)=O
: