Target
Phosphatidylcholine:ceramide cholinephosphotransferase 1
Ligand
BDBM50282224
Substrate
Meas. Tech.
ChEMBL_1724007 (CHEMBL4139285)
IC50
1000±n/a nM
Citation
 Adachi, ROgawa, KMatsumoto, SISatou, TTanaka, YSakamoto, JNakahata, TOkamoto, RKamaura, MKawamoto, T Discovery and characterization of selective human sphingomyelin synthase 2 inhibitors. Eur J Med Chem 136:283-293 (2017)  
Target
Name:
Phosphatidylcholine:ceramide cholinephosphotransferase 1
Synonyms:
MOB Protein Mob SMS1 Sphingomyelin synthase 1 Transmembrane protein 23
Type:
PROTEIN
Mol. Mass.:
48630.99
Organism:
Homo sapiens (Human)
Description:
ChEMBL_109868
Residue:
413
  
Inhibitor
Name:
BDBM50282224
Synonyms:
CHEMBL4172856
Type:
Small organic molecule
Emp. Form.:
C34H37F6N3O5
Mol. Mass.:
681.6651
SMILES:
CN(Cc1cc(cc(c1)C(F)(F)F)C(F)(F)F)C(=O)c1c(OCCCC2CCN(CC2)C(=O)OC2(C)CC2)c2ccccc2n(C)c1=O
: