Target
Prostaglandin G/H synthase 2
Ligand
BDBM50283373
Substrate
Meas. Tech.
ChEMBL_1725339 (CHEMBL4140617)
IC50
270±n/a nM
Citation
 Perrone, MGVitale, PFerorelli, SBoccarelli, AColuccia, MPannunzio, ACampanella, FDi Mauro, GBonaccorso, CFortuna, CGScilimati, A Effect of mofezolac-galactose distance in conjugates targeting cyclooxygenase (COX)-1 and CNS GLUT-1 carrier. Eur J Med Chem 141:404-416 (2017)  
Target
Name:
Prostaglandin G/H synthase 2
Synonyms:
COX2 Cyclooxygenase 2 (COX-2) Cyclooxygenase-2 (COX-2 AA) Cyclooxygenase-2 (COX-2) PGH2_HUMAN PHS II Prostaglandin E synthase/G/H synthase 2 Prostaglandin-endoperoxide synthase 2
Type:
Enzyme
Mol. Mass.:
69003.89
Organism:
Homo sapiens (Human)
Description:
Recombinant Cox-2 provided by Cayman (Cayman Chemical Co.,Ann Arbor, MI).
Residue:
604
  
Inhibitor
Name:
BDBM50283373
Synonyms:
CHEMBL4171339
Type:
Small organic molecule
Emp. Form.:
C36H48N2O11
Mol. Mass.:
684.7731
SMILES:
COc1ccc(cc1)-c1noc(CC(=O)NCCCCCCCCCCC(=O)OC[C@H]2OC(O)[C@H](O)[C@@H](O)[C@H]2O)c1-c1ccc(OC)cc1
: