Target
Prostaglandin G/H synthase 1
Ligand
BDBM50376383
Substrate
Meas. Tech.
ChEMBL_1725337 (CHEMBL4140615)
IC50
7.9±n/a nM
Citation
 Perrone, MGVitale, PFerorelli, SBoccarelli, AColuccia, MPannunzio, ACampanella, FDi Mauro, GBonaccorso, CFortuna, CGScilimati, A Effect of mofezolac-galactose distance in conjugates targeting cyclooxygenase (COX)-1 and CNS GLUT-1 carrier. Eur J Med Chem 141:404-416 (2017)  
Target
Name:
Prostaglandin G/H synthase 1
Synonyms:
COX-1 Cyclooxygenase Cyclooxygenase-1 (COX-1) PTGS1 | Prostaglandin G/H synthase (cyclooxygenase)
Type:
Enzyme
Mol. Mass.:
68692.62
Organism:
Homo sapiens (Human)
Description:
P23219
Residue:
599
  
Inhibitor
Name:
BDBM50376383
Synonyms:
CHEMBL259972
Type:
Small organic molecule
Emp. Form.:
C19H17NO5
Mol. Mass.:
339.342
SMILES:
COc1ccc(cc1)-c1noc(CC(O)=O)c1-c1ccc(OC)cc1
: