Target
Sodium/glucose cotransporter 2
Ligand
BDBM50285397
Substrate
Meas. Tech.
ChEMBL_1728109 (CHEMBL4143387)
EC50
194±n/a nM
Citation
 Yuan, MCYeh, TKChen, CTSong, JSHuang, YCHsieh, TCHuang, CYHuang, YLWang, MHWu, SHYao, CHChao, YSLee, JC Identification of an oxime-containing C-glucosylarene as a potential inhibitor of sodium-dependent glucose co-transporter 2. Eur J Med Chem 143:611-620 (2018)  
Target
Name:
Sodium/glucose cotransporter 2
Synonyms:
Na(+)/glucose cotransporter 2 SGLT2 Sodium-Dependent Glucose Cotransporter 2 (SGLT2) Solute carrier family 5 member 2
Type:
Protein
Mol. Mass.:
72902.00
Organism:
Homo sapiens (Human)
Description:
P31639
Residue:
672
  
Inhibitor
Name:
BDBM50285397
Synonyms:
CHEMBL4160788
Type:
Small organic molecule
Emp. Form.:
C23H28ClNO7
Mol. Mass.:
465.924
SMILES:
CCOc1ccc(Cc2cc(ccc2Cl)[C@@H]2O[C@H](\C=N\OCCO)[C@@H](O)[C@H](O)[C@H]2O)cc1
: