Target
Cholecystokinin receptor type A
Ligand
BDBM50016505
Substrate
Meas. Tech.
ChEMBL_49395 (CHEMBL658757)
Ki
19±n/a nM
Citation
 Marseigne, IRoy, PDor, ADurieux, CPélaprat, DReibaud, MBlanchard, JCRoques, BP Full agonists of CCK8 containing a nonhydrolyzable sulfated tyrosine residue. J Med Chem 32:445-9 (1989)  
Target
Name:
Cholecystokinin receptor type A
Synonyms:
CCK-A receptor CCK1-R CCKAR_CAVPO Cholecystokinin receptor type A | Cholecystokinin-1 receptor
Type:
Mol. Mass.:
48229.77
Organism:
Cavia porcellus
Description:
Residue:
430
  
Inhibitor
Name:
BDBM50016505
Synonyms:
CHEMBL217767 | Sodium; (4-{2-(2-acetylamino-3-carboxy-propionylamino)-2-[1-({[1-{1-[1-(1-carbamoyl-2-phenyl-ethylcarbamoyl)-2-carboxy-ethylcarbamoyl]-pentylcarbamoyl}-2-(1H-indol-3-yl)-ethylcarbamoyl]-methyl}-carbamoyl)-pentylcarbamoyl]-ethyl}-phenyl)-methanesulfonate
Type:
Small organic molecule
Emp. Form.:
C50H64N9O13S
Mol. Mass.:
1031.161
SMILES:
CCCC[C@H](NC(=O)[C@@H](Cc1ccc(CS([O-])(=O)=O)cc1)NC(C)=O)C(=O)NCC(=O)N[C@@H](Cc1c[nH]c2ccccc12)C(=O)N[C@@H](CCCC)C(=O)N[C@@H](CC(O)=O)C(=O)N[C@@H](Cc1ccccc1)C(N)=O
: