Target
Trifunctional purine biosynthetic protein adenosine-3
Ligand
BDBM50016659
Substrate
Meas. Tech.
ChEBML_69918
IC50
0.001±n/a nM
Comments
0.0011 20220121
Citation
 Nair, MGMurthy, BRPatil, SDKisliuk, RLThorndike, JGaumont, YFerone, RDuch, DSEdelstein, MP Folate analogues. 31. Synthesis of the reduced derivatives of 11-deazahomofolic acid, 10-methyl-11-deazahomofolic acid, and their evaluation as inhibitors of glycinamide ribonucleotide formyltransferase. J Med Chem 32:1277-83 (1989)  
Target
Name:
Trifunctional purine biosynthetic protein adenosine-3
Synonyms:
GAR Tfase GART Glycinamide ribonucleotide transformylase (GAR Tfase) PRGS Thymidylate synthase/GAR transformylase/AICAR transformylase
Type:
Protein
Mol. Mass.:
107768.47
Organism:
Homo sapiens (Human)
Description:
P22102
Residue:
1010
  
Inhibitor
Name:
BDBM50016659
Synonyms:
2-{4-[3-(2-Amino-4-oxo-3,4,5,6,7,8-hexahydro-pteridin-6-yl)-2-methyl-propyl]-benzoylamino}-pentanedioic acid | CHEMBL23699
Type:
Small organic molecule
Emp. Form.:
C22H28N6O6
Mol. Mass.:
472.4943
SMILES:
CC(CC1CNc2nc(N)[nH]c(=O)c2N1)Cc1ccc(cc1)C(=O)NC(CCC(O)=O)C(O)=O
: