Target
Mitogen-activated protein kinase 15
Ligand
BDBM2579
Substrate
Meas. Tech.
ChEMBL_1730333 (CHEMBL4145869)
IC50
7.3±n/a nM
Citation
 Farag, AKElkamhawy, ALondhe, AMLee, KTPae, ANRoh, EJ Novel LCK/FMS inhibitors based on phenoxypyrimidine scaffold as potential treatment for inflammatory disorders. Eur J Med Chem 141:657-675 (2017)  
Target
Name:
Mitogen-activated protein kinase 15
Synonyms:
ERK-8 ERK8 MAPK15 Mitogen-activated protein kinase 15
Type:
Serine/threonine-protein kinase
Mol. Mass.:
59850.14
Organism:
Homo sapiens (Human)
Description:
gi_95147356
Residue:
544
  
Inhibitor
Name:
BDBM2579
Synonyms:
(2S,3R,4R,6R)-3-methoxy-2-methyl-4-(methylamino)-29-oxa-1,7,17-triazaoctacyclo[12.12.2.1^{2,6}.0^{7,28}.0^{8,13}.0^{15,19}.0^{20,27}.0^{21,26}]nonacosa-8(13),9,11,14(28),15(19),20(27),21(26),22,24-nonaen-16-one Staurosporin, 4 Staurosporine, 8 US9206188, Staurosporine | US9226923, Staurosporine
Type:
Small organic molecule
Emp. Form.:
C28H26N4O3
Mol. Mass.:
466.531
SMILES:
CN[C@@H]1C[C@H]2O[C@@](C)([C@@H]1OC)n1c3ccccc3c3c4CNC(=O)c4c4c5ccccc5n2c4c13
: