Target
Induced myeloid leukemia cell differentiation protein Mcl-1
Ligand
BDBM50376902
Substrate
Meas. Tech.
ChEMBL_1732228 (CHEMBL4147764)
IC50
2900±n/a nM
Citation
 Wan, YDai, NTang, ZFang, H Small-molecule Mcl-1 inhibitors: Emerging anti-tumor agents. Eur J Med Chem 146:471-482 (2018)  
Target
Name:
Induced myeloid leukemia cell differentiation protein Mcl-1
Synonyms:
BCL2L3 Bcl-2-like protein 3 (Mcl-1) Bcl2-L-3 MCL1 Mcl-1 Myeloid cell leukemia sequence 1 (BCL2-related) | mcl1/EAT
Type:
Membrane; Single-pass membrane protein
Mol. Mass.:
37332.87
Organism:
Homo sapiens (Human)
Description:
Q07820
Residue:
350
  
Inhibitor
Name:
BDBM50376902
Synonyms:
CHEMBL408194
Type:
Small organic molecule
Emp. Form.:
C20H19N3O
Mol. Mass.:
317.3844
SMILES:
COC1=CC(=N\C1=C/c1[nH]c(C)cc1C)c1cc2ccccc2[nH]1
: