Target
Bromodomain adjacent to zinc finger domain protein 2B
Ligand
BDBM50311439
Substrate
Meas. Tech.
ChEBML_1733136
IC50
1690±n/a nM
Citation
 Xiang, QWang, CZhang, YXue, XSong, MZhang, CLi, CWu, CLi, KHui, XZhou, YSmaill, JBPatterson, AVWu, DDing, KXu, Y Discovery and optimization of 1-(1H-indol-1-yl)ethanone derivatives as CBP/EP300 bromodomain inhibitors for the treatment of castration-resistant prostate cancer. Eur J Med Chem 147:238-252 (2018)  
Target
Name:
Bromodomain adjacent to zinc finger domain protein 2B
Synonyms:
BAZ2B KIAA1476 | hWALp4
Type:
PROTEIN
Mol. Mass.:
240455.43
Organism:
Homo sapiens (Human)
Description:
ChEMBL_1498197
Residue:
2168
  
Inhibitor
Name:
BDBM50311439
Synonyms:
CHEMBL4159164
Type:
Small organic molecule
Emp. Form.:
C22H16N2O5
Mol. Mass.:
388.3728
SMILES:
CC(=O)n1cc(C(=O)Nc2cc(cc(c2)-c2ccco2)C(O)=O)c2ccccc12
: