Target
Glycogen phosphorylase, liver form
Ligand
BDBM50312362
Substrate
Meas. Tech.
ChEMBL_1733216 (CHEMBL4148752)
Ki
2230±n/a nM
Citation
 Kun, SBegum, JKyriakis, EStamati, ECVBarkas, TASzennyes, EBokor, ÉSzabó, KEStravodimos, GASipos, ÁDocsa, TGergely, PMoffatt, CPatraskaki, MSKokolaki, MCGkerdi, ASkamnaki, VTLeonidas, DDSomsák, LHayes, JM A multidisciplinary study of 3-(?-d-glucopyranosyl)-5-substituted-1,2,4-triazole derivatives as glycogen phosphorylase inhibitors: Computation, synthesis, crystallography and kinetics reveal new potent inhibitors. Eur J Med Chem 147:266-278 (2018)  
Target
Name:
Glycogen phosphorylase, liver form
Synonyms:
Glycogen Phosphorylase (PYGL) Liver glycogen phosphorylase PYGL_HUMAN
Type:
Homodimer
Mol. Mass.:
97153.98
Organism:
Homo sapiens (Human)
Description:
Dimers associate into a tetramer to form the enzymatically active phosphorylase A.
Residue:
847
  
Inhibitor
Name:
BDBM50312362
Synonyms:
CHEMBL4176460
Type:
Small organic molecule
Emp. Form.:
C20H21N3O5
Mol. Mass.:
383.3978
SMILES:
OC[C@H]1O[C@H]([C@H](O)[C@@H](O)[C@@H]1O)c1nc(n[nH]1)-c1ccc(cc1)-c1ccccc1
: