Target
Carbonic anhydrase 9
Ligand
BDBM50341402
Substrate
Meas. Tech.
ChEMBL_1734836 (CHEMBL4150372)
Ki
0.570000±n/a nM
Citation
 Salerno, SBarresi, EAmendola, GBerrino, EMilite, CMarini, AMDa Settimo, FNovellino, ESupuran, CTCosconati, STaliani, S 4-Substituted Benzenesulfonamides Incorporating Bi/Tricyclic Moieties Act as Potent and Isoform-Selective Carbonic Anhydrase II/IX Inhibitors. J Med Chem 61:5765-5770 (2018)  
Target
Name:
Carbonic anhydrase 9
Synonyms:
CA-IX CAH9_HUMAN Carbonic anhydrase 9 (CA IX) Carbonic anhydrase 9 precursor Carbonic anhydrase IX (CAIX) Carbonic anhydrases; II & IX MN RCC-associated antigen G250
Type:
Enzyme
Mol. Mass.:
49669.03
Organism:
Homo sapiens (Human)
Description:
Catalytic domain of human cloned isozyme was used in the assay
Residue:
459
  
Inhibitor
Name:
BDBM50341402
Synonyms:
CHEMBL4167173
Type:
Small organic molecule
Emp. Form.:
C15H13N5O2S
Mol. Mass.:
327.361
SMILES:
NS(=O)(=O)c1ccc(cc1)-n1ncc2CCc3ncncc3-c12
: